BDBM50012341 CHEMBL69458::[4-(4-{4-[2-Oxo-2-(6-oxo-5,6-dihydro-benzo[e]pyrido[3,2-b][1,4]diazepin-11-yl)-ethyl]-piperazin-1-ylmethyl}-benzoylamino)-butyl]-carbamic acid tert-butyl ester
SMILES CC(C)(C)OC(=O)NCCCCNC(=O)c1ccc(CN2CCN(CC(=O)N3c4ccccc4C(=O)Nc4cccnc34)CC2)cc1
InChI Key InChIKey=BPJFLYYIRYPSDC-UHFFFAOYSA-N
Data  3 KI
  Tab Delimited (TSV)   2D SDfile   Computed 3D by Vconf -m prep SDfile
Find this compound or compounds like it in BindingDB:
Activity Spreadsheet -- Enzyme Inhibition Constant Data from BindingDB
Found 1 hit for monomerid = 50012341
LigandPNGBDBM50012341(CHEMBL69458 | [4-(4-{4-[2-Oxo-2-(6-oxo-5,6-dihydro...)
Affinity DataKi:  1.68E+3nM. Assay description: Inhibition of binding of [3H]-N-methylscopolamine to muscarinic acetylcholine receptor M1 of transfected rat A9L cells.
In DepthDetails ArticlePubMed